{"text_format":"1","workbook":"xlsx","n_sheets":16,"sheets":["Introduction","Step 1 - Project Information","Step 2 - Project Type","Test","Communication","Comm","DMS","DMS Calc","CCTV","CCTV Calc","TRAWS","TRAWS Calc","Other","PARAMETERS","REFERENCES","DROP-DOWNS"],"not_rendered":{"charts":0,"images":1,"macros":1,"external_links":3,"defined_names":16,"comments":0,"pivot_tables":0},"unopened":[],"bounds":{"document_bytes":16777216,"sheet_cells":100000,"rows_first":2000,"rows_last":500,"rows_between":2000,"halvings":0,"cell_chars":16384,"cell_head_chars":4096},"cells_cut":0,"cells_raw":0,"read":"whole","date_system":"1900"}

{"sheet":"Introduction","index":0,"n_rows":26,"n_cols":10,"rows_kept":26,"cut":false,"hidden":false,"merged":[[21,2,21,3],[22,2,24,3],[13,2,14,3],[2,3,2,6],[5,2,5,9],[6,2,6,9],[4,2,4,9],[7,2,7,9],[8,2,8,9],[9,2,9,9],[13,5,13,9],[13,4,14,4],[15,2,16,3],[17,2,20,3]]}
[]
[null,null,null,"Transportation System Management and Operations - Traffic Infrastructure Process (TSMO-TIP)"]
[null,null,null,"Project Benefit-Cost Analysis"]
[]
[null,null,"Introduction:"]
[null,null,"The Project Benefit-Cost Analysis Tool has been developed to assess and quantify potential monetary benefits per project type. The Project Benefit-Cost Analysis Tool uses readily available, project specific data from the user and industry research to estimate potential project benefits. Project types include: Communication, DMS, CCTV Camera, Through Route Activated Warning System (TRAWS), and other. \n\nSeveral types of project benefits are considered for each project type: safety, mobility, productivity, and energy and environment. These estimated project benefits are then compared to the estimated total project cost. This methodology provides a clear and transparent manner in which to consider the value of a specific project, reducing concerns of inefficient use of funding resources.\n"]
[null,null,"User Instruction:"]
[null,null,"Step 1 - Complete Project Information. \nStep 2 - Select the Project Type you are proposing. \nStep 3 - Perform Project Benefit-Cost Analysis by providing project specific responses for each of the questions as appropriate. \n*It should be noted that this analysis is a generalized, estimated approach to considering potential monetary benefits. It is expected that some responses will be estimates based on the users knowledge of the project and location."]
[null,null,"User Resources:"]
[null,null,"The 'Data Needs' table below may be referenced to determine where each of the data requests may be obtained. Data sources include the Needs Analysis Tool, readily available information from the User, User estimated values, and asset management/maintenance information. For any questions or concerns, contact Todd Szymkowski (todd.szymkowski@dot.wi.gov)."]
[]
[null,null,"Project Benefit-Cost Analysis Data Needs"]
[]
[null,null,"Anticipated Data Source",null,"Data Need","Project Type"]
[null,null,null,null,null,"Communication Expansion","DMS","Camera","TRAWS","Other"]
{"$rows_left_out":12}
{"sheet":"Step 1 - Project Information","index":1,"n_rows":69,"n_cols":5,"rows_kept":69,"cut":false,"hidden":false,"merged":[[63,3,63,5],[65,2,65,5],[66,2,66,5],[68,2,68,5],[69,2,69,5],[53,3,53,5],[55,3,55,5],[57,3,57,5],[59,3,59,5],[61,3,61,5],[45,2,45,5],[47,3,47,5],[49,3,49,5],[51,3,51,5],[43,2,43,5],[37,2,37,5],[38,2,38,5],[40,2,40,5],[41,2,41,5],[34,5,35,5],[2,2,2,5],[9,2,9,5],[17,2,17,5],[18,2,18,5],[20,2,20,5],[4,4,4,5],[5,4,5,5],[6,4,6,5]]}
[]
[null,null,{"$f":"Introduction!D2","v":"Transportation System Management and Operations - Traffic Infrastructure Process (TSMO-TIP)"}]
[null,null,"Step 1 - Project Information"]
[]
[null,null,null,"Region:"]
[null,null,null,"Proposed Project Name:"]
[null,null,null,"Requested By:"]
[]
[]
[null,1,"Using each of the following Needs Analysis Tool presets, provide the anticipated level of need in the vicinity of the proposed project. Access the Needs Analysis Tool here: https://transportal.cee.wisc.edu/gis/webmaps/tip."]
[null,null,null,null,"Default TIP"]
[null,null,null,null,"Safety"]
[null,null,null,null,"Mobility (Present)"]
[null,null,null,null,"Mobility (Future)"]
[null,null,null,null,"Service"]
{"$rows_left_out":55}
{"sheet":"Step 2 - Project Type","index":2,"n_rows":20,"n_cols":3,"rows_kept":20,"cut":false,"hidden":false,"merged":[[17,2,17,4],[19,2,19,4],[14,2,14,4],[12,2,12,4],[2,2,2,4],[4,2,4,4],[6,2,6,4],[8,2,8,4],[10,2,10,4]]}
[]
[null,null,{"$f":"Introduction!D2","v":"Transportation System Management and Operations - Traffic Infrastructure Process (TSMO-TIP)"}]
[null,null,"Step 2 - Project Type"]
[]
[null,null,"Communication"]
[]
[null,null,"DMS "]
[]
[null,null,"CCTV "]
[]
[null,null,"TRAWS"]
[]
[null,null,"Other"]
[]
[null,null,"Test"]
{"$rows_left_out":6}
{"sheet":"Test","index":3,"n_rows":4,"n_cols":3,"rows_kept":4,"cut":false,"hidden":true,"merged":[[2,2,2,4]]}
[null,null,"Transportation System Management and Operations - Traffic Infrastructure Process"]
[null,null,"Project Benefits - Test "]
[]
[null,null,"Back"]

{"sheet":"Communication","index":4,"n_rows":101,"n_cols":11,"rows_kept":101,"cut":false,"hidden":true,"merged":[[10,4,10,9],[100,9,100,10],[38,4,38,9],[2,4,2,10],[7,8,7,9],[11,8,11,9],[5,4,5,7],[6,4,6,7],[7,4,7,7],[3,4,3,9],[5,8,5,9],[6,8,6,9],[13,4,13,9],[29,4,29,9],[35,4,35,9],[32,4,32,9],[23,4,23,9],[46,4,46,8],[52,4,52,8],[55,4,55,8],[49,4,49,8]]}
[]
[null,null,null,null,"Transportation System Management and Operations - Traffic Infrastructure Process"]
[null,null,null,null,"Project Benefit-Cost Analysis - Communication Infrastructure"]
[null,null,null,null,"Design-build and integrate fiber optic links between existing fiber infrastructure and signal systems, or procure and install cellular Ethernet modems. "]
[]
[null,null,null,null,"Region:",null,null,null,{"$f":"IF('Step 1 - Project Information'!E5=0, \"-\",'Step 1 - Project Information'!E5)","v":"-"}]
[null,null,null,null,"Proposed Project Name:",null,null,null,{"$f":"IF('Step 1 - Project Information'!E6=0, \"-\",'Step 1 - Project Information'!E6)","v":"-"}]
[null,null,null,null,"Requested By:",null,null,null,{"$f":"IF('Step 1 - Project Information'!E7=0, \"-\",'Step 1 - Project Information'!E7)","v":"-"}]
[]
[]
[null,null,null,1,"What is the anticipated present value cost of the project?"]
[]
[]
[null,null,null,2,"Using each of the following Needs Analysis Tool presets, provide the anticipated level of need in the vicinity of the proposed project:"]
[null,null,null,null,null,null,null,null,"Default TIP",{"$f":"IF('Step 1 - Project Information'!F11=0,\"-\",'Step 1 - Project Information'!F11)","v":"-"}]
{"$rows_left_out":87}
{"sheet":"Comm","index":5,"n_rows":131,"n_cols":10,"rows_kept":131,"cut":false,"hidden":true,"merged":[[36,5,36,7],[49,4,49,7],[58,4,58,8],[65,4,65,8],[68,4,68,8],[40,4,40,8],[43,4,43,10],[46,4,46,10],[61,4,61,8],[62,4,62,8],[124,8,124,9],[125,8,125,9],[80,5,80,8],[82,5,82,8],[84,5,84,8],[2,4,2,10],[3,4,3,8],[5,4,5,6],[5,7,5,8],[6,4,6,6],[6,7,6,8],[7,4,7,6],[7,7,7,8],[10,4,10,6],[10,7,10,8],[35,5,35,7],[12,4,12,8],[32,4,32,8],[22,4,22,9],[28,5,28,7]]}
[]
[null,null,null,null,"Transportation System Management and Operations - Traffic Infrastructure Process"]
[null,null,null,null,{"$f":"Communication!E3","v":"Project Benefit-Cost Analysis - Communication Infrastructure"}]
[null,null,null,null,"Design-build and integrate fiber optic links between existing fiber infrastructure and signal systems, or procure and install cellular Ethernet modems. "]
[]
[null,null,null,null,"Region:",null,null,{"$f":"IF('Step 1 - Project Information'!E5=0, \"-\",'Step 1 - Project Information'!E5)","v":"-"}]
[null,null,null,null,"Proposed Project Name:",null,null,{"$f":"IF('Step 1 - Project Information'!E6=0, \"-\",'Step 1 - Project Information'!E6)","v":"-"}]
[null,null,null,null,"Requested By:",null,null,{"$f":"IF('Step 1 - Project Information'!E7=0, \"-\",'Step 1 - Project Information'!E7)","v":"-"}]
[]
[]
[null,null,null,1,"What is the anticipated cost of the project?",null,null,{"$f":"Communication!I12","v":0}]
[]
[null,null,null,2,"Using each of the following Needs Analysis Tool presets, provide the anticipated level of need in the vicinity of the proposed project:"]
[null,null,null,null,null,null,null,"Default TIP",{"$f":"IF('Step 1 - Project Information'!F11=0,\"-\",'Step 1 - Project Information'!F11)","v":"-"}]
[null,null,null,null,null,null,null,"Safety",{"$f":"IF('Step 1 - Project Information'!F12=0,\"-\",'Step 1 - Project Information'!F12)","v":"-"}]
{"$rows_left_out":117}
{"sheet":"DMS","index":6,"n_rows":137,"n_cols":10,"rows_kept":137,"cut":false,"hidden":true,"merged":[[136,7,136,8],[67,4,67,8],[72,4,72,7],[61,6,61,8],[86,4,86,7],[80,4,80,7],[1,3,2,3],[1,4,1,8],[15,6,15,7],[3,4,3,6],[5,6,5,7],[6,6,6,7],[7,6,7,7],[14,4,14,7],[2,4,2,9],[10,4,10,6],[12,4,12,6],[16,6,16,7],[62,3,62,8],[26,4,26,8],[25,3,25,8],[40,4,40,8],[18,6,18,7],[32,4,32,8],[28,4,28,8],[41,4,41,8],[42,4,42,8],[39,3,39,8],[21,2,21,10],[33,3,33,8],[48,3,48,8],[31,4,31,8],[29,4,29,8],[43,4,43,8],[44,4,44,8],[45,4,45,8],[17,6,17,7],[27,4,27,8],[30,4,30,8],[56,4,56,8],[83,4,83,7],[89,4,89,7],[63,4,63,8],[64,4,64,8],[65,4,65,8],[66,4,66,8],[57,3,57,8],[68,3,68,8],[54,4,54,8],[46,4,46,8],[47,4,47,8],[55,4,55,8],[53,3,53,8]]}
[]
[null,null,null,null,"Transportation System Management and Operations - Traffic Infrastructure Process"]
[null,null,null,null,"Project Benefit-Cost Analysis - Dynamic Message Sign (DMS)"]
[]
[]
[null,null,null,null,null,"Region:",{"$f":"IF('Step 1 - Project Information'!E5=0, \"-\",'Step 1 - Project Information'!E5)","v":"-"}]
[null,null,null,null,null,"Proposed Project Name:",{"$f":"IF('Step 1 - Project Information'!E6=0, \"-\",'Step 1 - Project Information'!E6)","v":"-"}]
[null,null,null,null,null,"Requested By:",{"$f":"IF('Step 1 - Project Information'!E7=0, \"-\",'Step 1 - Project Information'!E7)","v":"-"}]
[]
[]
[null,null,null,1,"What is the anticipated cost of the project (total design, construction, and communication cost)?"]
[]
[null,null,null,2,"What is the anticipated number of DMS to be installed for the project?"]
[]
[null,null,null,3,"Please complete the Guidance Analysis below to define the intent of the project. The summary of your results is listed here: "]
{"$rows_left_out":123}
{"sheet":"DMS Calc","index":7,"n_rows":294,"n_cols":16,"rows_kept":294,"cut":false,"hidden":true,"merged":[[0,3,0,6],[102,3,102,5],[16,5,16,6],[17,5,17,6],[18,5,18,6],[19,5,19,6],[66,3,66,5],[84,3,84,4],[79,3,79,6],[27,3,27,6],[82,3,82,4],[56,3,56,5],[92,3,92,5],[4,4,4,5],[5,4,5,5],[6,4,6,5],[9,5,9,6],[11,3,11,5],[35,5,35,6],[36,5,36,6],[37,5,37,6],[116,3,116,4],[158,6,158,7],[1,3,1,7],[42,3,42,6],[49,3,49,6],[59,3,59,6],[105,3,105,5],[157,6,157,7],[38,5,38,6],[34,3,34,5],[13,3,13,6],[14,5,14,6],[21,3,21,6],[24,3,24,6],[30,3,30,6],[15,5,15,6]]}
[null,null,null,{"$f":"DMS!E2","v":"Transportation System Management and Operations - Traffic Infrastructure Process"}]
[null,null,null,{"$f":"DMS!E3","v":"Project Benefit-Cost Analysis - Dynamic Message Sign (DMS)"}]
[null,null,null,"New DMS Deployment."]
[]
[null,null,null,"Region:",{"$f":"DMS!G6","v":"-"}]
[null,null,null,"Proposed Project Name:",{"$f":"DMS!G7","v":"-"}]
[null,null,null,"Requested By:",{"$f":"DMS!G8","v":"-"}]
[]
[]
[null,null,1,"What is the anticipated cost of the project?",null,{"$f":"DMS!H11","v":0}]
[]
[null,null,2,"What is the anticipated number of DMS to be installed for the project?",null,null,{"$f":"DMS!H13","v":0}]
[]
[null,null,3,"Provide the anticipated level of need in the vicinity of the proposed project using the following Needs Analysis Tool presets:"]
[null,null,null,null,"Default TIP",{"$f":"'Step 1 - Project Information'!F11","v":0}]
{"$rows_left_out":280}
{"sheet":"CCTV","index":8,"n_rows":155,"n_cols":10,"rows_kept":155,"cut":false,"hidden":true,"merged":[[78,4,78,7],[81,6,81,7],[82,6,82,7],[73,4,73,8],[80,6,80,7],[75,3,75,8],[74,4,74,8],[79,6,79,7],[83,6,83,7],[84,6,84,7],[154,7,154,8],[88,4,88,7],[117,4,117,7],[119,4,119,7],[100,4,100,7],[106,4,106,7],[109,4,109,7],[103,4,103,7],[10,6,10,7],[13,6,13,7],[28,3,28,8],[61,3,61,8],[7,6,7,7],[15,4,15,8],[16,6,16,7],[17,6,17,7],[18,6,18,7],[19,6,19,7],[56,3,56,8],[57,4,57,8],[40,4,40,8],[41,4,41,8],[42,4,42,8],[24,2,24,10],[6,6,6,7],[1,3,2,3],[1,4,1,8],[3,4,3,6],[5,6,5,7],[2,4,2,9],[39,4,39,8],[32,3,32,8],[26,3,26,8],[29,4,29,8],[30,4,30,8],[31,4,31,8],[43,4,43,8],[72,4,72,8],[65,4,65,8],[66,4,66,8],[67,4,67,8],[52,4,52,8],[55,6,55,8],[53,3,53,8],[58,4,58,8],[63,6,63,8],[64,3,64,8],[68,3,68,8],[70,6,70,8],[71,3,71,8],[70,3,70,5],[12,4,12,7],[9,4,9,7],[44,3,44,8],[59,4,59,8],[60,4,60,8],[46,6,46,8],[47,3,47,8],[48,4,48,8],[49,4,49,8],[50,4,50,8],[51,4,51,8],[20,6,20,7],[21,6,21,7],[37,4,37,8],[36,3,36,8],[38,4,38,8]]}
[]
[null,null,null,null,"Transportation System Management and Operations - Traffic Infrastructure Process"]
[null,null,null,null,"Project Benefit-Cost Analysis - CCTV Camera"]
[]
[]
[null,null,null,null,null,"Region:",{"$f":"IF('Step 1 - Project Information'!E5=0, \"-\",'Step 1 - Project Information'!E5)","v":"-"}]
[null,null,null,null,null,"Proposed Project Name:",{"$f":"IF('Step 1 - Project Information'!E6=0, \"-\",'Step 1 - Project Information'!E6)","v":"-"}]
[null,null,null,null,null,"Requested By:",{"$f":"IF('Step 1 - Project Information'!E7=0, \"-\",'Step 1 - Project Information'!E7)","v":"-"}]
[]
[null,null,null,1,"What is the anticipated cost of the project?"]
[]
[]
[null,null,null,2,"What is the anticipated number of cameras to be installed for the project?"]
[]
[]
{"$rows_left_out":141}
{"sheet":"CCTV Calc","index":9,"n_rows":205,"n_cols":10,"rows_kept":205,"cut":false,"hidden":true,"merged":[[172,3,172,4],[168,3,168,4],[166,3,166,4],[174,3,174,4],[1,3,1,7],[13,5,13,6],[6,5,6,6],[9,3,9,4],[11,3,11,6],[12,5,12,6],[10,5,10,6],[31,3,31,5],[20,3,20,6],[21,5,21,6],[22,5,22,6],[23,5,23,6],[0,2,1,2],[0,3,0,7],[2,3,2,5],[4,5,4,6],[5,5,5,6],[24,5,24,6],[25,5,25,6],[26,5,26,6],[109,3,109,6],[38,3,38,5],[45,3,45,5],[48,3,48,5],[50,3,50,5],[53,3,53,5],[60,3,60,5],[67,3,67,5],[80,3,80,5],[83,3,83,6],[106,3,106,6],[115,3,115,6],[118,3,118,6],[201,6,201,7],[99,3,99,5],[14,5,14,6],[15,5,15,6],[16,5,16,6],[17,5,17,6],[200,6,200,7],[149,3,149,5],[158,3,158,5],[163,3,163,5],[112,3,112,6],[121,3,121,6],[140,3,140,5],[144,3,144,5]]}
[null,null,null,"Transportation System Management and Operations"]
[null,null,null,"Project Benefit-Cost Analysis - CCTV Camera"]
[]
[]
[null,null,null,null,"Region:",{"$f":"'Step 1 - Project Information'!E5","v":0}]
[null,null,null,null,"Proposed Project Name:",{"$f":"'Step 1 - Project Information'!E6","v":0}]
[null,null,null,null,"Requested By:",{"$f":"'Step 1 - Project Information'!E7","v":0}]
[]
[]
[null,null,1,"What is the anticipated cost of the project?"]
[null,null,null,null,null,{"$f":"CCTV!G11","v":0}]
[null,null,2,"Provide the anticipated level of need in the vicinity of the proposed project using the following Needs Analysis Tool presets:"]
[null,null,null,null,"Default TIP",{"$f":"'Step 1 - Project Information'!F11","v":0}]
[null,null,null,null,"Safety",{"$f":"'Step 1 - Project Information'!F12","v":0}]
[null,null,null,null,"Mobility (Present)",{"$f":"'Step 1 - Project Information'!F13","v":0}]
{"$rows_left_out":191}
{"sheet":"TRAWS","index":10,"n_rows":61,"n_cols":9,"rows_kept":61,"cut":false,"hidden":true,"merged":[[21,6,21,7],[24,4,24,7],[60,7,60,8],[10,6,10,7],[13,6,13,7],[16,6,16,7],[17,6,17,7],[18,6,18,7],[19,6,19,7],[20,6,20,7],[15,4,15,5],[12,4,12,7],[9,4,9,7],[1,2,2,2],[1,3,1,8],[2,3,2,8],[3,3,3,6],[6,6,6,7],[5,6,5,7],[4,6,4,7]]}
[]
[null,null,null,"Transportation System Management and Operations - Traffic Infrastructure Process"]
[null,null,null,"Project Benefit-Cost Analysis - TRAWS"]
[]
[null,null,null,null,null,"Region:",{"$f":"IF('Step 1 - Project Information'!E5=0, \"-\",'Step 1 - Project Information'!E5)","v":"-"}]
[null,null,null,null,null,"Proposed Project Name:",{"$f":"IF('Step 1 - Project Information'!E6=0, \"-\",'Step 1 - Project Information'!E6)","v":"-"}]
[null,null,null,null,null,"Proposed Project Benefit Analyst:",{"$f":"IF('Step 1 - Project Information'!E7=0, \"-\",'Step 1 - Project Information'!E7)","v":"-"}]
[]
[]
[null,null,null,1,"What is the expected design and present value construction cost (total project cost)?"]
[]
[]
[null,null,null,2,"What is the anticipated number of TRAWS sites to be installed for the project?"]
[]
[]
{"$rows_left_out":47}
{"sheet":"TRAWS Calc","index":11,"n_rows":80,"n_cols":8,"rows_kept":80,"cut":false,"hidden":true,"merged":[[16,5,16,6],[17,5,17,6],[24,3,24,5],[31,3,31,5],[38,3,38,5],[1,3,1,7],[75,6,75,7],[76,6,76,7],[0,3,0,6],[41,3,41,5],[48,3,48,5],[5,5,5,6],[4,5,4,6],[6,5,6,6],[9,3,9,4],[9,5,9,6],[11,3,11,6],[12,5,12,6],[13,5,13,6],[14,5,14,6],[15,5,15,6]]}
[null,null,null,{"$f":"DMS!E2","v":"Transportation System Management and Operations - Traffic Infrastructure Process"}]
[null,null,null,{"$f":"TRAWS!D3","v":"Project Benefit-Cost Analysis - TRAWS"}]
[]
[]
[null,null,null,null,"Region:",{"$f":"'Step 1 - Project Information'!E5","v":0}]
[null,null,null,null,"Proposed Project Name:",{"$f":"'Step 1 - Project Information'!E6","v":0}]
[null,null,null,null,"Requested By:",{"$f":"'Step 1 - Project Information'!E7","v":0}]
[]
[]
[null,null,1,"What is the anticipated cost of the project?",null,{"$f":"TRAWS!G11","v":0}]
[]
[null,null,2,"Provide the anticipated level of need in the vicinity of the proposed project using the following Needs Analysis Tool presets:"]
[null,null,null,null,"Default TIP",{"$f":"'Step 1 - Project Information'!F11","v":0}]
[null,null,null,null,"Safety",{"$f":"'Step 1 - Project Information'!F12","v":0}]
[null,null,null,null,"Mobility (Present)",{"$f":"'Step 1 - Project Information'!F13","v":0}]
{"$rows_left_out":66}
{"sheet":"Other","index":12,"n_rows":44,"n_cols":6,"rows_kept":44,"cut":false,"hidden":true,"merged":[[2,3,2,5],[21,3,21,5],[27,3,27,5],[22,3,22,5],[4,4,4,5],[5,4,5,5],[6,4,6,5],[8,4,8,5],[10,3,10,5],[28,3,28,5],[33,3,33,5],[34,3,34,5],[39,3,39,5],[40,3,40,5]]}
[]
[null,null,null,"Transportation System Management and Operations - Traffic Infrastructure Process"]
[null,null,null,"Project Benefits - Other"]
[]
[null,null,null,"Region:",{"$f":"IF('Step 1 - Project Information'!E5=0, \"-\",'Step 1 - Project Information'!E5)","v":"-"}]
[null,null,null,"Proposed Project Name:",{"$f":"IF('Step 1 - Project Information'!E6=0, \"-\",'Step 1 - Project Information'!E6)","v":"-"}]
[null,null,null,"Proposed Project Benefit Analyst:",{"$f":"IF('Step 1 - Project Information'!E7=0, \"-\",'Step 1 - Project Information'!E7)","v":"-"}]
[]
[null,null,1,"What is the expected design and construction cost (total project cost)?"]
[]
[null,null,2,"Provide the anticipated level of need in the vicinity of the proposed project using the following Needs Analysis Tool presets:"]
[null,null,null,null,"Default TIP",{"$f":"IF('Step 1 - Project Information'!F11=0,\"-\",'Step 1 - Project Information'!F11)","v":"-"}]
[null,null,null,null,"Safety",{"$f":"IF('Step 1 - Project Information'!F12=0,\"-\",'Step 1 - Project Information'!F12)","v":"-"}]
[null,null,null,null,"Mobility (Present)",{"$f":"IF('Step 1 - Project Information'!F13=0,\"-\",'Step 1 - Project Information'!F13)","v":"-"}]
[null,null,null,null,"Mobility (Future)",{"$f":"IF('Step 1 - Project Information'!F14=0,\"-\",'Step 1 - Project Information'!F14)","v":"-"}]
{"$rows_left_out":30}
{"sheet":"PARAMETERS","index":13,"n_rows":77,"n_cols":9,"rows_kept":77,"cut":false,"hidden":false,"merged":[[6,2,10,2],[11,2,12,2],[47,2,49,2],[6,7,10,7]]}
[]
[null,null,"Transportation System Management and Operations - Traffic Infrastructure Process"]
[null,null,"Project Benefit-Cost Analysis - Parameters"]
[]
[null,null,"Safety Parameters"]
[null,null,"Source","Description","Value",null,null,"Comments"]
[null,null,"Guidance on Treatment of the Economic Value of Statistical Life in the US (2019) estimates plus 1.6% (2020), 7.0% (2021) the consumer price index, as per the US Bureau of Labor Statistics in the MN region (1).","Fatal Injury",{"$f":"12500000*D77","v":13000000},null,null,"Updated based on 2024 Benefit Cost analysis for discretionary grants"]
[null,null,null,"Suspected Serious Injury",{"$f":"1188200*D77","v":1235728}]
[null,null,null,"Suspected Minor Injury",{"$f":"233800*D77","v":243152}]
[null,null,null,"Possible Injury",{"$f":"111700*D77","v":116168}]
[null,null,null,"Property Damage-Only",{"$f":"5000*D77","v":5200}]
[null,null,"Average Crash Rate per MEV (2).","Rural Crash Rate (per MEV)",0.96]
[null,null,null,"Urban Crash Rate (per MEV)",1.05]
[null,null,"Average crash reduction due to DMS (14).","percent reduction",8.6]
[null,null,"Average crash reduction due to signal retiming (3).","percent reduction",31]
{"$rows_left_out":63}
{"sheet":"REFERENCES","index":14,"n_rows":61,"n_cols":4,"rows_kept":61,"cut":false,"hidden":false,"merged":[[5,2,7,2],[8,2,10,2],[11,2,13,2],[14,2,16,2],[17,2,19,2],[20,2,22,2],[23,2,25,2],[26,2,28,2],[29,2,31,2],[32,2,33,2],[49,2,51,2],[52,2,54,2],[55,2,57,2],[34,2,36,2],[37,2,39,2],[40,2,42,2],[43,2,45,2],[46,2,48,2]]}
[]
[null,null,"Transportation System Management and Operations - Traffic Infrastructure Process"]
[null,null,"Project Benefit-Cost Analysis - Parameters"]
[]
[null,null,"References"]
[null,null,1,"https://www.transportation.gov/sites/dot.gov/files/2023-12/Benefit%20Cost%20Analysis%20Guidance%202024%20Update.pdf"]
[null,null,null,"Benefit Cost Analysis for Discretionary Grants December 2023 (page 39)"]
[null,null,null,"2024-07-01"]
[null,null,2,"https://www.fhwa.dot.gov/tpm/guidance/avo_factors.pdf"]
[null,null,null,"Geometric Categories as Intersection Safety Evaluation Tools (page 3)"]
[null,null,null,2005]
[null,null,3,"https://www.itskrs.its.dot.gov/sites/default/files/docs/The%20Benefits%20of%20Retiming%20Traffic%20Signals%20%28ITE%20Journal%29.pdf"]
[null,null,null,"The Benefits of Retiming Traffic Signals (page 18)"]
[null,null,null,"2004-04-01"]
[null,null,4,"http://www.fhwa.dot.gov/publications/researc/safety/04091/08.cfm"]
{"$rows_left_out":47}
{"sheet":"DROP-DOWNS","index":15,"n_rows":7,"n_cols":51,"rows_kept":7,"cut":false,"hidden":true,"merged":[[0,28,0,29],[0,37,0,38]]}
["YES.NO",null,"ITS Device Project Purpose",null,"Signal Project Purpose",null,"Signal Replace Type",null,"Region",null,"Region2",null,"3 Project Type",null,"Expansion Type",null,"Expansion Purpose",null,"Software Upgrade",null,"Urban or Rural",null,"Increased Maintenance",null,"Signal Retrofit Type",null,"Vehicles Entering",null,"Percent Ticket Reduction",null,null,"Travel Time Reduction",null,"Location Type",null,"ITS Device Type",null,"Work Order Avg Ticket Amount",null,"#",null,"Needs Identification","Corresponding Delay (s)",null,"LOS","Corresponding Delay (s)",null,null,"Link Importance",null,"Detection Types"]
["YES",null,"Enhanced Traveler Information",null,"Increase Vehicular Safety",null,"Geometric Changes",null,"BTO",null,"Southeast",null,"Signal Retrofit",null,"Wireless/Cellular to Fiber Expansion",null,"Establish Signal Communications",null,"Next Generation Upgrade",null,"Urban",null,"6 months",null,"Monotubes",null,"> 2,000 vehs entering the avg intersection",null,"1 - 5",{"$f":"AVERAGE(1,5)","v":3},null,"Slight",null,"Intersection",null,"CCTV",null,"BTO",1253,211,null,"LOW",10,null,"A",5,null,null,"Critical"]
["NO",null,"Enhanced Incident Management",null,"Decrease Maintenance Efforts",null,"Addition of Turn Lane(s)",null,"Southeast",null,"Southwest",null,"LED Signal Replacement",null,"Communications Backbone",null,"Eliminate Necessity for Service Provider",null,"Current Software Replacement",null,"Rural",null,"1 year",null,"Flashing Yellow Arrows",null,"< 2,000 vehs entering the avg intersection",null,"6 - 15",{"$f":"AVERAGE(6,15)","v":10.5},null,"Moderate",null,"Non-Intersection",null,"DMS",null,"Southeast",316,1048,null,"MEDIUM",35,null,"B",15,null,null,"Somewhat Critical",null,"Microwave Detection"]
["PARTIAL",null,null,null,null,null,"Cabinet Adjustments",null,"Southwest",null,"Northeast",null,null,null,null,null,null,null,"New Software Deployment",null,null,null,"3 years",null,"Minor Safety Improvements",null,null,null,"16 - 30",{"$f":"AVERAGE(16,30)","v":23},null,"Significant",null,null,null,"Detection",null,"Southwest",482,218,null,"HIGH",75,null,"C",27.5,null,null,"Important",null,"Bluetooth Detection"]
[null,null,null,null,null,null,"Other",null,"Northeast",null,"North Central",null,null,null,null,null,null,null,null,null,null,null,null,null,"Adaptive Signal System",null,null,null,"31 - 50",{"$f":"AVERAGE(31,50)","v":40.5},null,null,null,null,null,"Other",null,"Northeast",437,86,null,"N/A",{"$f":"NA()","v":{"$error":"#N/A"}},null,"D",45,null,null,null,null,"Probe Data"]
[null,null,null,null,null,null,null,null,"North Central",null,"Northwest",null,null,null,null,null,null,null,null,null,null,null,null,null,null,null,null,null,"51 - 75",{"$f":"AVERAGE(51,75)","v":63},null,null,null,null,null,null,null,"North Central",444,23,null,null,null,null,"E",67.5,null,null,null,null,"Thermal Detection"]
[null,null,null,null,null,null,null,null,"Northwest",null,null,null,null,null,null,null,null,null,null,null,null,null,null,null,null,null,null,null,"76 - 95",{"$f":"AVERAGE(76,95)","v":85.5},null,null,null,null,null,null,null,"Northwest",733,104,null,null,null,null,"F",85,null,null,null,null,"Radar Detection"]